{"text_format":"1","workbook":"xlsx","n_sheets":14,"sheets":["Capa","Glossario","Parametros","Rel_01","Apoio_Rel01","Base_SMART200","Rel_02","Apoio_Rel02","Base_SP","Rel_03","Apoio_Rel03","Base_RJ","tblFeriados","tblUsuarios"],"not_rendered":{"charts":0,"images":5,"macros":1,"external_links":2,"defined_names":24,"comments":0,"pivot_tables":3},"unopened":[],"bounds":{"document_bytes":16777216,"sheet_cells":100000,"rows_first":2000,"rows_last":500,"rows_between":2000,"halvings":0,"cell_chars":16384,"cell_head_chars":4096},"cells_cut":0,"cells_raw":0,"read":"whole","date_system":"1900"}

{"sheet":"Capa","index":0,"n_rows":0,"n_cols":0,"rows_kept":0,"cut":false,"hidden":false,"merged":[]}

{"sheet":"Glossario","index":1,"n_rows":25,"n_cols":3,"rows_kept":25,"cut":false,"hidden":true,"merged":[[24,2,24,4],[25,2,25,4],[6,2,6,10],[9,2,9,10],[12,2,12,10],[15,2,15,10],[18,2,18,10],[21,2,21,10]]}
[]
[]
[]
[]
[]
[]
[null,"Fonte:","xx"]
[]
[]
[null,"Período:","Diário"]
[]
[]
[null,"Forma de extração:","Extração da base através da ferramenta Online."]
[]
[]
{"$rows_left_out":11}
{"sheet":"Parametros","index":2,"n_rows":27,"n_cols":26,"rows_kept":27,"cut":false,"hidden":true,"merged":[[1,22,16,22],[18,12,33,12],[1,0,5,0],[1,12,6,12],[7,0,25,0],[22,1,24,1],[11,12,14,12]]}
[null,null,null,null,null,null,null,null,null,null,null,null,null,null,null,null,null,null,null,null,null,null,null,"NOME","REGRA?"]
["CAPA","TITULO RELATORIO","ATUALIZAÇÃO DA REDE CREDENCIADA - PME",null,null,null,null,null,null,null,null,null,"CONTROLES","ZOOM",80,null,null,null,null,null,null,null,"PLANILHAS VISIVEIS","Capa",true,true]
[null,"USUARIO ALTERAÇÃO",{"$f":"IFERROR(VLOOKUP(tblUsuarios!$E$1,tblUsuarios!$A:$B,2,0),\"*** Cadastre o Usuário ***\")","v":"Jefferson Barbosa"},null,null,null,null,null,null,null,null,null,null,null,null,null,null,null,null,null,null,null,null,"Glossario",false]
[null,"DATA ELABORAÇÃO","2019-04-11T17:37:45",null,null,null,null,null,null,null,null,null,null,null,null,null,null,null,null,null,null,null,null,"Parametros",true]
[null,"DATA REFERÊNCIA",{"$f":"C4","v":"2019-04-11T17:37:45"},null,null,null,null,null,null,null,null,null,null,null,null,null,null,null,null,null,null,null,null,"Rel_01",true]
[null,"VERSÃO","1.0",null,null,null,null,null,null,null,null,null,null,null,null,null,null,null,null,null,null,null,null,"Apoio_Rel01",{"$f":"$Z$2","v":true}]
[null,null,null,null,null,null,null,null,null,null,null,null,null,null,null,null,null,null,null,null,null,null,null,"Base_SMART200",{"$f":"$Z$2","v":true}]
["DATAS E PERÍODOS","MÊS ATUAL",{"$f":"UPPER(TEXT($C$4,\"mmmm\"))","v":"ABRIL"},{"$f":"PROPER(TEXT($C$4,\"mmmm\"))","v":"Abril"},{"$f":"UPPER(TEXT($C$4,\"MMM\"))","v":"ABR"},{"$f":"PROPER(TEXT($C$4,\"MMM\"))","v":"Abr"},null,null,null,null,null,null,null,null,null,null,null,null,null,null,null,null,null,"Rel_02",true]
[null,"INICIO MÊS",{"$f":"DATE(YEAR($C$4),MONTH($C$4),1)","v":"2019-04-01"},null,null,null,null,null,null,null,null,null,null,null,null,null,null,null,null,null,null,null,null,"Apoio_Rel02",{"$f":"$Z$2","v":true}]
[null,"FIM MÊS",{"$f":"EOMONTH(C9,0)","v":"2019-04-30"},null,null,null,null,null,null,null,null,null,null,null,null,null,null,null,null,null,null,null,null,"Base_SP",{"$f":"$Z$2","v":true}]
[null,"DIAS ÚTEIS",{"$f":"NETWORKDAYS(DATE(YEAR(C5),MONTH(C5),1),EOMONTH(C5,0),tblFeriados!$A$2:$A$20)","v":22},null,null,null,null,null,null,null,null,null,null,null,"NOME","RGB",null,null,null,null,null,null,null,"Rel_03",true]
[null,"MÊS ANTERIOR",{"$f":"UPPER(TEXT(EDATE($C$5,-1),\"MMMM\"))","v":"MARÇO"},{"$f":"PROPER(TEXT(EDATE($C$5,-1),\"MMMM\"))","v":"Março"},{"$f":"UPPER(TEXT(EDATE($C$5,-1),\"MMM\"))","v":"MAR"},{"$f":"PROPER(TEXT(EDATE($C$5,-1),\"MMM\"))","v":"Mar"},null,null,null,null,null,null,"CORES",null,"LARANJA ESCURO","241; 90; 34",null,null,null,null,null,null,null,"Apoio_Rel03",{"$f":"$Z$2","v":true}]
[null,"INICIO MÊS",{"$f":"DATE(YEAR($C$4),MONTH($C$4)-1,1)","v":"2019-03-01"},null,null,null,null,null,null,null,null,null,null,null,"LARANJA PRINCIPAL","244; 158;0",null,null,null,null,null,null,null,"Base_RJ",{"$f":"$Z$2","v":true}]
[null,"FIM MÊS",{"$f":"EOMONTH(C13,0)","v":"2019-03-31"},null,null,null,null,null,null,null,null,null,null,null,"CARMIM / BEGE","249; 237; 211",null,null,null,null,null,null,null,"tblFeriados",false]
[null,"DIAS ÚTEIS",{"$f":"NETWORKDAYS(DATE(YEAR(C5),MONTH(C5)-1,1),EOMONTH(EDATE(C5,-1),0),tblFeriados!$A$2:$A$20)","v":21},null,null,null,null,null,null,null,null,null,null,null,"CINZA PRINCIPAL","80; 80; 90",null,null,null,null,null,null,null,"tblUsuarios",false]
{"$rows_left_out":13}
{"sheet":"Rel_01","index":3,"n_rows":68,"n_cols":16,"rows_kept":68,"cut":false,"hidden":false,"merged":[]}
[]
[null,null,null,null,null,null,"","","","","","",""]
[null,null,null,null,null,null,"","","","","","",""]
[null,null,null,null,null,null,"","","","","","",""]
[null,null,null,null,null,null,"","","","","","",""]
[null,null,null,null,null,null,null,"","","","","",""]
[null,"ID","REDE","REGIÃO","CIDADE","PRESTADOR",{"$f":"Base_SMART200!G1","v":"SMART 150 ABC"},{"$f":"Base_SMART200!H1","v":"SMART 200 ABC + BAIXADA"},{"$f":"Base_SMART200!I1","v":"SMART 200 CAMPINAS"},{"$f":"Base_SMART200!J1","v":"SMART 200 SP CAPITAL"},{"$f":"Base_SMART200!K1","v":"SMART 200 GUARULHOS"},{"$f":"Base_SMART200!L1","v":"SMART 200 JUNDIAÍ"},{"$f":"Base_SMART200!M1","v":"SMART 200 SP OESTE"},{"$f":"Base_SMART200!N1","v":"SMART 200 SOROCABA"},{"$f":"Base_SMART200!O1","v":"SMART 200 SAMED"},{"$f":"Base_SMART200!P1","v":"SMART 200 UP"}]
[null,43,"HOSPITAIS","GRANDE SAO PAULO","GUARULHOS","HOSP E MAT GUARULHOS","-","-","-","-","H/M/PS","-","-","-","H","H/M/PS"]
[null,44,"HOSPITAIS","GRANDE SAO PAULO","GUARULHOS","CC GUARULHOS I","-","-","-","-","PA*","-","-","-","-","PA*"]
[null,45,"HOSPITAIS","GRANDE SAO PAULO","GUARULHOS","CC GUARULHOS II","-","-","-","-","PA*","-","-","-","-","PA*"]
[null,49,"HOSPITAIS","GRANDE SAO PAULO","BARUERI","CC ALPHAVILLE","-","-","-","-","-","-","PA*","-","-","PA*"]
[null,50,"HOSPITAIS","GRANDE SAO PAULO","BARUERI","PS BARUERI","-","-","-","-","-","-","P S","-","-","P S"]
[null,51,"HOSPITAIS","GRANDE SAO PAULO","CARAPICUIBA","CC CARAPICUIBA","-","-","-","-","-","-","PA*","-","-","PA*"]
[null,52,"HOSPITAIS","GRANDE SAO PAULO","OSASCO","UNIDADE AVANCADA CRUZEIRO DO SUL","-","-","-","-","-","-","PA*","-","-","PA*"]
[null,53,"HOSPITAIS","GRANDE SAO PAULO","TABOAO DA SERRA","FAMILY HOSP SS LTDA","-","-","-","-","-","-","H/M/PS","-","-","H/M/PS"]
{"$rows_left_out":54}
{"sheet":"Apoio_Rel01","index":4,"n_rows":60,"n_cols":9,"rows_kept":60,"cut":false,"hidden":true,"merged":[[10,8,15,12],[1,8,4,14],[6,8,8,13],[5,8,5,12]]}
["ID","REDE","REGIÃO","CIDADE","PRESTADOR",null,null,null,"MENSAGENS"]
[43,"HOSPITAIS","GRANDE SAO PAULO","GUARULHOS","HOSP E MAT GUARULHOS",null,null,null,"A Rede Credenciada pode ser alterada a qualquer momento, seguindo as diretrizes normativas da ANS. Para consultar a rede completa e atualizada, acesse o site: "]
[44,"HOSPITAIS","GRANDE SAO PAULO","GUARULHOS","CC GUARULHOS I"]
[45,"HOSPITAIS","GRANDE SAO PAULO","GUARULHOS","CC GUARULHOS II"]
[49,"HOSPITAIS","GRANDE SAO PAULO","BARUERI","CC ALPHAVILLE"]
[50,"HOSPITAIS","GRANDE SAO PAULO","BARUERI","PS BARUERI",null,null,null,"www.gndi.com.br"]
[51,"HOSPITAIS","GRANDE SAO PAULO","CARAPICUIBA","CC CARAPICUIBA",null,null,null," A Rede é disponibilizada de acordo com o plano contratado."]
[52,"HOSPITAIS","GRANDE SAO PAULO","OSASCO","UNIDADE AVANCADA CRUZEIRO DO SUL"]
[53,"HOSPITAIS","GRANDE SAO PAULO","TABOAO DA SERRA","FAMILY HOSP SS LTDA"]
[54,"HOSPITAIS","GRANDE SAO PAULO","TABOAO DA SERRA","CC TABOAO DA SERRA",null,null,null,"LEGENDA"]
[55,"HOSPITAIS","GRANDE SAO PAULO","COTIA","CC COTIA",null,null,null,"H - HOSPITAL \nM - MATERNIDADE \nPS - PRONTO-SOCORRO \nPA - PRONTO ATENDIMENTO"]
[56,"HOSPITAIS","GRANDE SAO PAULO","COTIA","HOSPITAL E MATERNIDADE NOVA VIDA"]
[57,"HOSPITAIS","GRANDE SAO PAULO","ITAPEVI","HOSPITAL E MATERNIDADE NOVA VIDA"]
[58,"HOSPITAIS","GRANDE SAO PAULO","ITAPEVI","HOSPITAL CRUZEIRO DO SUL ITAPEVI"]
[59,"HOSPITAIS","GRANDE SAO PAULO","ITAPEVI","CC ITAPEVI"]
{"$rows_left_out":46}
{"sheet":"Base_SMART200","index":5,"n_rows":182,"n_cols":16,"rows_kept":182,"cut":false,"hidden":true,"merged":[]}
["ID","ARQUIVO","REDE","REGIÃO","CIDADE","PRESTADOR","SMART 150 ABC","SMART 200 ABC + BAIXADA","SMART 200 CAMPINAS","SMART 200 SP CAPITAL","SMART 200 GUARULHOS","SMART 200 JUNDIAÍ","SMART 200 SP OESTE","SMART 200 SOROCABA","SMART 200 SAMED","SMART 200 UP"]
[{"$f":"ROW()-1","v":1},"SMART 200","HOSPITAIS","SAO PAULO /  CAPITAL","SAO PAULO /  LESTE","CASA DE SAUDE SANTA MARCELINA (TRANSPLANTE DE MEDULA OSSEA ADULTO)","H","H",null,"H","H",null,"H",null,null,"H"]
[2,"SMART 200","HOSPITAIS","SAO PAULO ABC / DIADEMA","DIADEMA","CC DIADEMA ",null,"PA",null,null,null,null,null,null,null,"PA"]
[3,"SMART 200","HOSPITAIS","BAIXADA SANTISTA","GUARUJA","CC FREI GALVAO -GUARUJA",null,"PA*",null,null,null,null,null,null,null,"PA*"]
[4,"SMART 200","HOSPITAIS","BAIXADA SANTISTA","SAO VICENTE","CC FREI GALVAO SAO VICENTE",null,"PA*",null,null,null,null,null,null,null,"PA*"]
[5,"SMART 200","HOSPITAIS","SAO PAULO ABC / MAUA","MAUA","CC MAUA 1 (ANTIGO CC MAUA)",null,"PA*",null,null,null,null,null,null,null,"PA*"]
[6,"SMART 200","HOSPITAIS","SAO PAULO ABC / RIBEIRAO PIRES","RIBEIRAO PIRES","CC RIBEIRAO PIRES",null,"PA",null,null,null,null,null,null,null,"PA"]
[7,"SMART 200","HOSPITAIS","SAO PAULO ABC / SANTO ANDRE","SANTO ANDRE","CC SANTO ANDRE 1 (ANTIGO CC SANTO ANDRE I )","PA","PA",null,null,null,null,null,null,null,"PA"]
[8,"SMART 200","HOSPITAIS","SAO PAULO ABC / SANTO ANDRE","SANTO ANDRE","CC SANTO ANDRE 4 (ANTIGO PA SANTO ANDRE)","PA*","PA*",null,null,null,null,null,null,null,"PA*"]
[9,"SMART 200","HOSPITAIS","SAO PAULO ABC / SANTO ANDRE","SANTO ANDRE","CC SANTO ANDRE 2 (ANTIGO PA SANTO ANDRE)","PA","PA",null,null,null,null,null,null,null,"PA"]
[10,"SMART 200","HOSPITAIS","SAO PAULO ABC / SAO CAETANO DO SUL","SAO CAETANO DO SUL","CC SAO CAETANO 1(ANTIGO CC SAO CAETANO I)",null,"PA*",null,null,null,null,null,null,null,"PA*"]
[11,"SMART 200","HOSPITAIS","SAO PAULO ABC / SAO BERNARDO DO CAMPO","SAO BERNARDO DO CAMPO","CENTRO DE TRATAMENTO BEZERRA DE MENEZES",null,"H/PS ",null,null,null,null,null,null,null,"H/PS "]
[12,"SMART 200","HOSPITAIS","SAO PAULO ABC / SAO BERNARDO DO CAMPO","SAO BERNARDO DO CAMPO","CC SAO BERNARDO",null,"PA*",null,null,null,null,null,null,null,"PA*"]
[13,"SMART 200","HOSPITAIS","SAO PAULO /  CAPITAL","SAO PAULO /  SUL","HOSPITAL DO RIM E HIPERTENSAO (TRANSPLANTE RENAL)","H","H","H","H","H","H","H","H","H","H"]
[14,"SMART 200","HOSPITAIS","SAO PAULO /  CAPITAL","SAO PAULO /  SUL","GRAACC - TRANSPLANTE DE MEDULA OSSEA INFANTIL)","H","H","H","H","H","H","H","H","H","H"]
{"$rows_left_out":168}
{"sheet":"Rel_02","index":6,"n_rows":768,"n_cols":14,"rows_kept":768,"cut":false,"hidden":false,"merged":[]}
[]
[]
[]
[]
[]
[]
[null,"ID","REDE","REGIÃO","CIDADE","PRESTADOR",{"$f":"Base_SP!G1","v":"SMART 300"},{"$f":"Base_SP!H1","v":"SMART 400"},{"$f":"Base_SP!I1","v":"SMART 500"},{"$f":"Base_SP!J1","v":"ADVANCE 600"},{"$f":"Base_SP!K1","v":"ADVANCE 700"},{"$f":"Base_SP!L1","v":"PREMIUM 900"},{"$f":"Base_SP!M1","v":"PREMIUM 900 CARE"},{"$f":"Base_SP!N1","v":"INFINITY"}]
[null,1,"HOSPITAIS","SAO PAULO - CAPITAL","SAO PAULO / CENTRO","CRUZ AZUL DE SAO PAULO","H/M","H/M","H/M","H/M","H/M/PS","H/M/PS","H/M/PS","H/M/PS"]
[null,2,"HOSPITAIS","SAO PAULO - CAPITAL","SAO PAULO / CENTRO","HOSPITAL INGLES","H","H","H","H","H","H","H","H"]
[null,3,"HOSPITAIS","SAO PAULO - CAPITAL","SAO PAULO / CENTRO","CC ANGELICA","PA*","PA*","PA*","PA*","PA*","PA*","PA*","PA*"]
[null,4,"HOSPITAIS","SAO PAULO - CAPITAL","SAO PAULO / CENTRO","HOSP E MAT SACRECOEUR","H/M","H/M","H/M","H/M","H/M","H/M","H/M","H/M"]
[null,5,"HOSPITAIS","SAO PAULO - CAPITAL","SAO PAULO / CENTRO","HOSP SANTA CECILIA","H/PS","H/PS","H/PS","H/PS","H/PS","H/PS","H/PS","H/PS"]
[null,6,"HOSPITAIS","SAO PAULO - CAPITAL","SAO PAULO / CENTRO","IGESP CT/MED CIR INST GASTRO DE SAO PAULO","-","H/PS","H/PS","H/PS","H/PS","H/PS","H/PS","H/PS"]
[null,7,"HOSPITAIS","SAO PAULO - CAPITAL","SAO PAULO / CENTRO","CERTA CENTRO DE REF EM TRAT AVANCADOS-HOSP DIA","-","-","-","H","H","H","H","H"]
[null,8,"HOSPITAIS","SAO PAULO - CAPITAL","SAO PAULO / CENTRO","HOSPITAL BANDEIRANTES S.A","-","-","-","H/PS","H/PS","H/PS","H/PS","H/PS"]
{"$rows_left_out":754}
{"sheet":"Apoio_Rel02","index":7,"n_rows":760,"n_cols":9,"rows_kept":760,"cut":false,"hidden":true,"merged":[[10,8,15,12],[1,8,6,13]]}
["ID","REDE","REGIÃO","CIDADE","NOME FANTASIA",null,null,null,"MENSAGENS"]
[1,"HOSPITAIS","SAO PAULO - CAPITAL","SAO PAULO / CENTRO","CRUZ AZUL DE SAO PAULO",null,null,null,"A Rede é disponibilizada de acordo com o plano contratado e pode ser alterada a qualquer momento, seguindo as diretrizes normativas da ANS. Para consultar a rede completa e atualizada, acesse o site: "]
[2,"HOSPITAIS","SAO PAULO - CAPITAL","SAO PAULO / CENTRO","HOSPITAL INGLES"]
[3,"HOSPITAIS","SAO PAULO - CAPITAL","SAO PAULO / CENTRO","CC ANGELICA"]
[4,"HOSPITAIS","SAO PAULO - CAPITAL","SAO PAULO / CENTRO","HOSP E MAT SACRECOEUR"]
[5,"HOSPITAIS","SAO PAULO - CAPITAL","SAO PAULO / CENTRO","HOSP SANTA CECILIA"]
[6,"HOSPITAIS","SAO PAULO - CAPITAL","SAO PAULO / CENTRO","IGESP CT/MED CIR INST GASTRO DE SAO PAULO"]
[7,"HOSPITAIS","SAO PAULO - CAPITAL","SAO PAULO / CENTRO","CERTA CENTRO DE REF EM TRAT AVANCADOS-HOSP DIA",null,null,null,"*Horário de atendimento diferenciado. "]
[8,"HOSPITAIS","SAO PAULO - CAPITAL","SAO PAULO / CENTRO","HOSPITAL BANDEIRANTES S.A"]
[9,"HOSPITAIS","SAO PAULO - CAPITAL","SAO PAULO / CENTRO","REAL E BEN SOC PORT BENF-HOSP SAO JOAQUIM",null,null,null,"LEGENDA"]
[10,"HOSPITAIS","SAO PAULO - CAPITAL","SAO PAULO / CENTRO","CENTRAL TOWERS HOSPITAL",null,null,null,"H - HOSPITAL \nM - MATERNIDADE \nPS - PRONTO-SOCORRO \nPA - PRONTO ATENDIMENTO"]
[11,"HOSPITAIS","SAO PAULO - CAPITAL","SAO PAULO / CENTRO","HOSP SANTA CATARINA"]
[12,"HOSPITAIS","SAO PAULO - CAPITAL","SAO PAULO / CENTRO","FUND ANTONIO PRUDENTE -HOSP A C CAMARGO"]
[13,"HOSPITAIS","SAO PAULO - CAPITAL","SAO PAULO / CENTRO","HOSP INFANTIL SABARA S A"]
[14,"HOSPITAIS","SAO PAULO - CAPITAL","SAO PAULO / CENTRO","HOSPITAL SAMARITANO DE SAO PAULO"]
{"$rows_left_out":746}
{"sheet":"Base_SP","index":8,"n_rows":760,"n_cols":14,"rows_kept":760,"cut":false,"hidden":true,"merged":[]}
["ID","ARQUIVO","REDE","REGIÃO","CIDADE","NOME FANTASIA","SMART 300","SMART 400","SMART 500","ADVANCE 600","ADVANCE 700","PREMIUM 900","PREMIUM 900 CARE","INFINITY"]
[{"$f":"ROW()-1","v":1},"SAO PAULO","HOSPITAIS","SAO PAULO - CAPITAL","SAO PAULO / CENTRO","CRUZ AZUL DE SAO PAULO","H/M","H/M","H/M","H/M","H/M/PS","H/M/PS","H/M/PS","H/M/PS"]
[{"$f":"ROW()-1","v":2},"SAO PAULO","HOSPITAIS","SAO PAULO - CAPITAL","SAO PAULO / CENTRO","HOSPITAL INGLES","H","H","H","H","H","H","H","H"]
[3,"SAO PAULO","HOSPITAIS","SAO PAULO - CAPITAL","SAO PAULO / CENTRO","CC ANGELICA","PA*","PA*","PA*","PA*","PA*","PA*","PA*","PA*"]
[4,"SAO PAULO","HOSPITAIS","SAO PAULO - CAPITAL","SAO PAULO / CENTRO","HOSP E MAT SACRECOEUR","H/M","H/M","H/M","H/M","H/M","H/M","H/M","H/M"]
[5,"SAO PAULO","HOSPITAIS","SAO PAULO - CAPITAL","SAO PAULO / CENTRO","HOSP SANTA CECILIA","H/PS","H/PS","H/PS","H/PS","H/PS","H/PS","H/PS","H/PS"]
[6,"SAO PAULO","HOSPITAIS","SAO PAULO - CAPITAL","SAO PAULO / CENTRO","IGESP CT/MED CIR INST GASTRO DE SAO PAULO",null,"H/PS","H/PS","H/PS","H/PS","H/PS","H/PS","H/PS"]
[7,"SAO PAULO","HOSPITAIS","SAO PAULO - CAPITAL","SAO PAULO / CENTRO","CERTA CENTRO DE REF EM TRAT AVANCADOS-HOSP DIA",null,null,null,"H","H","H","H","H"]
[8,"SAO PAULO","HOSPITAIS","SAO PAULO - CAPITAL","SAO PAULO / CENTRO","HOSPITAL BANDEIRANTES S.A",null,null,null,"H/PS","H/PS","H/PS","H/PS","H/PS"]
[9,"SAO PAULO","HOSPITAIS","SAO PAULO - CAPITAL","SAO PAULO / CENTRO","REAL E BEN SOC PORT BENF-HOSP SAO JOAQUIM",null,null,null,null,"H/PS","H/PS","H/PS","H/PS"]
[10,"SAO PAULO","HOSPITAIS","SAO PAULO - CAPITAL","SAO PAULO / CENTRO","CENTRAL TOWERS HOSPITAL",null,null,null,null,"H","H","H","H"]
[11,"SAO PAULO","HOSPITAIS","SAO PAULO - CAPITAL","SAO PAULO / CENTRO","HOSP SANTA CATARINA",null,null,null,null,null,"H/PS","H/PS","H/PS"]
[12,"SAO PAULO","HOSPITAIS","SAO PAULO - CAPITAL","SAO PAULO / CENTRO","FUND ANTONIO PRUDENTE -HOSP A C CAMARGO",null,null,null,null,null,"H/PS","H/PS","H/PS"]
[13,"SAO PAULO","HOSPITAIS","SAO PAULO - CAPITAL","SAO PAULO / CENTRO","HOSP INFANTIL SABARA S A",null,null,null,null,null,"H/PS","H/PS","H/PS"]
[14,"SAO PAULO","HOSPITAIS","SAO PAULO - CAPITAL","SAO PAULO / CENTRO","HOSPITAL SAMARITANO DE SAO PAULO",null,null,null,null,null,"H/M/PS","H/M/PS","H/M/PS"]
{"$rows_left_out":746}
{"sheet":"Rel_03","index":9,"n_rows":334,"n_cols":15,"rows_kept":334,"cut":false,"hidden":false,"merged":[]}
[]
[]
[]
[]
[]
[]
[null,"ID","REDE","REGIÃO","CIDADE","NOME FANTASIA",{"$f":"Base_RJ!G1","v":"SMART 200"},{"$f":"Base_RJ!H1","v":"SMART 300"},{"$f":"Base_RJ!I1","v":"SMART 400"},{"$f":"Base_RJ!J1","v":"SMART 500"},{"$f":"Base_RJ!K1","v":"ADVANCE 600"},{"$f":"Base_RJ!L1","v":"ADVANCE 700"},{"$f":"Base_RJ!M1","v":"PREMIUM 900"},{"$f":"Base_RJ!N1","v":"PREMIUM 900 CARE"},{"$f":"Base_RJ!O1","v":"INFINITY"}]
[null,1,"HOSPITAIS","RIO DE JANEIRO CAPITAL","RIO DE JANEIRO","CLINICA DA GAVEA S A","H","H","H","H","H","H","H","H","H"]
[null,2,"HOSPITAIS","RIO DE JANEIRO CAPITAL","RIO DE JANEIRO","HOSPITAL SAMCI ANDARAI","H","H","H","H","H","H","H","H","H"]
[null,3,"HOSPITAIS","RIO DE JANEIRO CAPITAL","RIO DE JANEIRO","CLINICA MEDICA AREIA BRANCA","H/M/PS","H/M/PS","H/M/PS","H/M/PS","H/M/PS","H/M/PS","H/M/PS","H/M/PS","H/M/PS"]
[null,4,"HOSPITAIS","RIO DE JANEIRO CAPITAL","RIO DE JANEIRO","CEMERU - AMESC ASSOCIACAO MEDICA ESPIRITA CRISTA","H/M/PS","PA","PA","PA","H/M/PS","H/M/PS","H/M/PS","H/M/PS","H/M/PS"]
[null,5,"HOSPITAIS","RIO DE JANEIRO CAPITAL","RIO DE JANEIRO","ASSISTENCIA MEDICA PEDIATRICA DE URGENCIA - AMIU","H/PS","H/M/PS","H/M/PS","H/M/PS","H/M/PS","H/M/PS","H/M/PS","H/M/PS","H/M/PS"]
[null,6,"HOSPITAIS","RIO DE JANEIRO CAPITAL","RIO DE JANEIRO","HOSPITAL QUALI IPANEMA","H/PS","H/M/PS","H/M/PS","H/M/PS","H/M/PS","H/M/PS","H/M/PS","H/M/PS","H/M/PS"]
[null,7,"HOSPITAIS","RIO DE JANEIRO CAPITAL","RIO DE JANEIRO","C SAUDE SAO BENTO (C SAUDE ROSA BARCA )","H/PS","H/PS","H/PS","H/PS","H/PS","H/PS","H/PS","H/PS","H/PS"]
[null,8,"HOSPITAIS","RIO DE JANEIRO CAPITAL","RIO DE JANEIRO","HOSPITAL RIO MAR","H/PS","H/PS","H/PS","H/PS","H/PS","H/PS","H/PS","H/PS","H/PS"]
{"$rows_left_out":320}
{"sheet":"Apoio_Rel03","index":10,"n_rows":326,"n_cols":5,"rows_kept":326,"cut":false,"hidden":true,"merged":[]}
["ID","REDE","REGIÃO","CIDADE","NOME FANTASIA"]
[1,"HOSPITAIS","RIO DE JANEIRO CAPITAL","RIO DE JANEIRO","CLINICA DA GAVEA S A"]
[2,"HOSPITAIS","RIO DE JANEIRO CAPITAL","RIO DE JANEIRO","HOSPITAL SAMCI ANDARAI"]
[3,"HOSPITAIS","RIO DE JANEIRO CAPITAL","RIO DE JANEIRO","CLINICA MEDICA AREIA BRANCA"]
[4,"HOSPITAIS","RIO DE JANEIRO CAPITAL","RIO DE JANEIRO","CEMERU - AMESC ASSOCIACAO MEDICA ESPIRITA CRISTA"]
[5,"HOSPITAIS","RIO DE JANEIRO CAPITAL","RIO DE JANEIRO","ASSISTENCIA MEDICA PEDIATRICA DE URGENCIA - AMIU"]
[6,"HOSPITAIS","RIO DE JANEIRO CAPITAL","RIO DE JANEIRO","HOSPITAL QUALI IPANEMA"]
[7,"HOSPITAIS","RIO DE JANEIRO CAPITAL","RIO DE JANEIRO","C SAUDE SAO BENTO (C SAUDE ROSA BARCA )"]
[8,"HOSPITAIS","RIO DE JANEIRO CAPITAL","RIO DE JANEIRO","HOSPITAL RIO MAR"]
[9,"HOSPITAIS","RIO DE JANEIRO CAPITAL","RIO DE JANEIRO","CLINICA CRISTO REI"]
[10,"HOSPITAIS","RIO DE JANEIRO CAPITAL","RIO DE JANEIRO","INSTITUTO DE OFTALMOLOGIA DO RIO DE JANEIRO"]
[11,"HOSPITAIS","RIO DE JANEIRO CAPITAL","RIO DE JANEIRO","HOSPITAL SAMCI TIJUCA"]
[12,"HOSPITAIS","RIO DE JANEIRO CAPITAL","RIO DE JANEIRO","CLINICA DE REPOUSO SANTA ALICE"]
[13,"HOSPITAIS","RIO DE JANEIRO CAPITAL","RIO DE JANEIRO","RIO DAY HOSPITAL"]
[14,"HOSPITAIS","RIO DE JANEIRO CAPITAL","RIO DE JANEIRO","CLINICA CIRURGICA SANTA BARBARA"]
{"$rows_left_out":312}
{"sheet":"Base_RJ","index":11,"n_rows":326,"n_cols":15,"rows_kept":326,"cut":false,"hidden":true,"merged":[]}
["ID","ARQUIVO","REDE","REGIÃO","CIDADE","NOME FANTASIA","SMART 200","SMART 300","SMART 400","SMART 500","ADVANCE 600","ADVANCE 700","PREMIUM 900","PREMIUM 900 CARE","INFINITY"]
[{"$f":"ROW()-1","v":1},"RIO DE JANEIRO","HOSPITAIS","RIO DE JANEIRO CAPITAL","RIO DE JANEIRO","CLINICA DA GAVEA S A","H","H","H","H","H","H","H","H","H"]
[{"$f":"ROW()-1","v":2},"RIO DE JANEIRO","HOSPITAIS","RIO DE JANEIRO CAPITAL","RIO DE JANEIRO","HOSPITAL SAMCI ANDARAI","H","H","H","H","H","H","H","H","H"]
[3,"RIO DE JANEIRO","HOSPITAIS","RIO DE JANEIRO CAPITAL","RIO DE JANEIRO","CLINICA MEDICA AREIA BRANCA","H/M/PS","H/M/PS","H/M/PS","H/M/PS","H/M/PS","H/M/PS","H/M/PS","H/M/PS","H/M/PS"]
[4,"RIO DE JANEIRO","HOSPITAIS","RIO DE JANEIRO CAPITAL","RIO DE JANEIRO","CEMERU - AMESC ASSOCIACAO MEDICA ESPIRITA CRISTA","H/M/PS","PA","PA","PA","H/M/PS","H/M/PS","H/M/PS","H/M/PS","H/M/PS"]
[5,"RIO DE JANEIRO","HOSPITAIS","RIO DE JANEIRO CAPITAL","RIO DE JANEIRO","ASSISTENCIA MEDICA PEDIATRICA DE URGENCIA - AMIU","H/PS","H/M/PS","H/M/PS","H/M/PS","H/M/PS","H/M/PS","H/M/PS","H/M/PS","H/M/PS"]
[6,"RIO DE JANEIRO","HOSPITAIS","RIO DE JANEIRO CAPITAL","RIO DE JANEIRO","HOSPITAL QUALI IPANEMA","H/PS","H/M/PS","H/M/PS","H/M/PS","H/M/PS","H/M/PS","H/M/PS","H/M/PS","H/M/PS"]
[7,"RIO DE JANEIRO","HOSPITAIS","RIO DE JANEIRO CAPITAL","RIO DE JANEIRO","C SAUDE SAO BENTO (C SAUDE ROSA BARCA )","H/PS","H/PS","H/PS","H/PS","H/PS","H/PS","H/PS","H/PS","H/PS"]
[8,"RIO DE JANEIRO","HOSPITAIS","RIO DE JANEIRO CAPITAL","RIO DE JANEIRO","HOSPITAL RIO MAR","H/PS","H/PS","H/PS","H/PS","H/PS","H/PS","H/PS","H/PS","H/PS"]
[9,"RIO DE JANEIRO","HOSPITAIS","RIO DE JANEIRO CAPITAL","RIO DE JANEIRO","CLINICA CRISTO REI","H/PS","H/PS","H/PS","H/PS","H/PS","H/PS","H/PS","H/PS","H/PS"]
[10,"RIO DE JANEIRO","HOSPITAIS","RIO DE JANEIRO CAPITAL","RIO DE JANEIRO","INSTITUTO DE OFTALMOLOGIA DO RIO DE JANEIRO","H/PS","H/PS","H/PS","H/PS","H/PS","H/PS","H/PS","H/PS","H/PS"]
[11,"RIO DE JANEIRO","HOSPITAIS","RIO DE JANEIRO CAPITAL","RIO DE JANEIRO","HOSPITAL SAMCI TIJUCA","H/PS","PS","PS","PS","PS","PS","PS","PS","PS"]
[12,"RIO DE JANEIRO","HOSPITAIS","RIO DE JANEIRO CAPITAL","RIO DE JANEIRO","CLINICA DE REPOUSO SANTA ALICE",null,"H","H","H","H","H","H","H","H"]
[13,"RIO DE JANEIRO","HOSPITAIS","RIO DE JANEIRO CAPITAL","RIO DE JANEIRO","RIO DAY HOSPITAL",null,"H","H","H","H","H","H","H","H"]
[14,"RIO DE JANEIRO","HOSPITAIS","RIO DE JANEIRO CAPITAL","RIO DE JANEIRO","CLINICA CIRURGICA SANTA BARBARA",null,"H","H","H","H/M/PS","H/M/PS","H/M/PS","H/M/PS","H/M/PS"]
{"$rows_left_out":312}
{"sheet":"tblFeriados","index":12,"n_rows":26,"n_cols":2,"rows_kept":26,"cut":false,"hidden":true,"merged":[]}
["DATA_FERIADO","DESCR_FERIADO"]
["2017-01-01","CONFRATERNIZAÇÃO UNIVERSAL"]
["2017-02-28","CARNAVAL"]
["2017-04-14","PAIXÃO DE CRISTO"]
["2017-04-21","TIRADENTES"]
["2017-05-01","DIA DO TRABALHO"]
["2017-06-15","CORPUS CHRISTI (FACULTATIVO)"]
["2017-09-07","INDEPENDÊNCIA DO BRASIL"]
["2017-10-12","NOSSA SENHORA APARECIDA"]
["2017-11-02","FINADOS"]
["2017-11-15","PROCLAMAÇÃO DA REPÚBLICA"]
["2017-12-25","NATAL"]
["2018-01-01","CONFRATERNIZAÇÃO UNIVERSAL"]
["2018-01-25","ANIVERSÁRIO DE SÃO PAULO"]
["2018-02-13","CARNAVAL"]
{"$rows_left_out":12}
{"sheet":"tblUsuarios","index":13,"n_rows":6,"n_cols":5,"rows_kept":6,"cut":false,"hidden":true,"merged":[]}
["USUARIO","NOME",null,"Usuario_Alteracao","jefferson.barbosa"]
["elani.santos","Elani Santos"]
["guilherme.herbst","Guilherme Herbst"]
["isabelle.inhota","Isabelle Inhota"]
["jefferson.barbosa","Jefferson Barbosa"]
["robinson.rodrigues","Robinson Silva"]